{"text_format":"1","workbook":"xlsx","n_sheets":10,"sheets":["Instructions","Summary","x","Coverage Analysis","CA Data-Validation","Effort","Cost-Expenses","Start up and Invoiceables","QQBR","Budget"],"not_rendered":{"charts":0,"images":1,"macros":1,"external_links":2,"defined_names":25,"comments":1,"pivot_tables":0},"unopened":[],"bounds":{"document_bytes":16777216,"sheet_cells":100000,"rows_first":2000,"rows_last":500,"rows_between":2000,"halvings":0,"cell_chars":16384,"cell_head_chars":4096},"cells_cut":0,"cells_raw":0,"read":"whole","date_system":"1900"}

{"sheet":"Instructions","index":0,"n_rows":107,"n_cols":2,"rows_kept":107,"cut":false,"hidden":false,"merged":[[75,0,76,5],[99,0,100,5],[64,0,65,5],[54,0,55,5],[0,0,1,5],[5,0,6,4],[35,0,36,5]]}
["BEFORE YOU BEGIN!!"]
[]
["Click the highlighted yellow bar at the top of the page"]
["on the EXP BASED COST & CA tab to enable Macros. "]
[]
["COMPLETING THE SUMMARY TAB"]
[]
[]
["Step 1: Complete the Project Information"]
[]
["Step 2: Complete the salary amount for the personnel that will work on the project.  If multiple staff are on the project, use the highest salary among the staff."]
["Step 3: The Fringe Rate is a tiered calculation."]
[]
["Personnel Costs Notes:"]
[null,"Effort is a calculation based on the information provided on the \"Effort\" tab.  This field is not editable and will populate from providing the information on the effort tab."]
{"$rows_left_out":93}
{"sheet":"Summary","index":1,"n_rows":64,"n_cols":16,"rows_kept":64,"cut":false,"hidden":false,"merged":[[34,9,34,10],[35,0,35,5],[36,7,36,9],[37,7,37,9],[38,7,38,9],[39,0,39,5],[4,3,4,5],[4,0,4,2],[55,6,61,6],[55,1,61,5],[55,0,61,0],[50,0,54,11],[55,7,61,11],[40,0,40,5],[40,6,40,11],[41,0,41,5],[41,6,41,11],[42,0,43,11],[44,0,49,11],[31,0,31,5],[32,0,32,5],[32,6,32,8],[32,9,32,10],[33,0,33,5],[33,6,33,8],[33,9,33,10],[26,0,26,6],[26,7,26,8],[27,0,28,11],[29,0,29,5],[29,6,29,8],[30,0,30,5],[30,6,30,8],[31,9,31,10],[23,0,23,1],[23,2,23,3],[23,4,23,5],[23,7,23,8],[25,0,25,1],[25,2,25,3],[25,4,25,5],[25,7,25,8],[21,0,21,1],[21,2,21,3],[21,4,21,5],[21,7,21,8],[22,0,22,1],[22,2,22,3],[22,4,22,5],[22,7,22,8],[24,4,24,5],[24,2,24,3],[24,0,24,1],[24,7,24,8],[19,0,19,1],[19,2,19,3],[19,4,19,5],[19,7,19,8],[20,0,20,1],[20,2,20,3],[20,4,20,5],[20,7,20,8],[16,0,16,1],[16,2,16,3],[16,4,16,5],[16,7,16,8],[17,0,17,1],[17,2,17,3],[17,4,17,5],[17,7,17,8],[18,0,18,1],[18,4,18,5],[18,2,18,3],[18,7,18,8],[15,0,15,11],[11,0,11,1],[11,2,11,5],[11,6,11,7],[11,8,11,11],[12,0,12,2],[12,3,12,5],[12,6,12,7],[12,8,12,11],[10,0,10,1],[10,2,10,5],[10,6,10,7],[10,8,10,11],[13,0,13,2],[13,3,13,5],[13,6,13,7],[13,9,13,11],[14,0,14,11],[8,1,8,11],[9,0,9,1],[9,2,9,5],[9,6,9,7],[9,8,9,11],[0,0,0,11],[1,0,1,11],[2,0,2,11],[3,0,3,11],[7,0,7,11],[5,10,5,11],[6,10,6,11],[5,3,5,5],[6,3,6,5],[5,7,5,8],[6,7,6,8],[5,0,5,2],[6,0,6,2]]}
["The University of Texas Health Science Center at Houston"]
["Clinical Trials Detailed Budget Worksheet "]
["THIS FILE IS FOR INTERNAL USE ONLY. CONTACT CRF@uth.tmc.edu WITH ANY COMMENTS OR QUESTIONS"]
["Version  11/25/2024"]
["Date:"]
["Coverage Analysis Complete By:",null,null,null,null,null,"Complexity","low",null,"Email:"]
["Budget Complete By:",null,null,null,null,null,"Phone",null,null,"Email:"]
["PROJECT INFORMATION:  Enter the information below.",null,null,null,null,null,null,null,null,null,null,null,null,"What does SC Administrative  time cover?"]
["Project Title:"]
["Principal Investigator:",null,null,null,null,null,"Department:"]
["Sponsor/CRO:",null,null,null,null,null,"Project Period:",null,null,null,null,null,null,"Organizing and upkeep of Subject files"]
["CPHS Study Number:",null,null,null,null,null,"Coordinator:",null,null,null,null,null,null,"Update PI and/or Sponsor on enrollment progress"]
["ClinicalTrials.gov # / NCT #:",null,null,null,null,null,"IDE #:",null,null,null,null,null,null,"Discussing study with collaborating researchers and PI (CO Is, Radiology, MHH, CRU, etc.)"]
["EXPECTED # OF PATIENTS:",null,null,null,null,null,"IDC RATE: ",null,0.3,"Non-negotiable for all industry sponsors.",null,null,null,"Pre-screening (review ERM and clinic  schedules to see if patient is eligible for screening visit and upcoming clinic visits)"]
["PERSONNEL COSTS:  These are required for the UTH internal budget, but are not always included in the sponsor's budget;  personnel costs are included in effort-based costs below; the PI's effort must be at least 2%.",null,null,null,null,null,null,null,null,null,null,null,null,"Phone calls with study subjects"]
{"$rows_left_out":50}
{"sheet":"x","index":2,"n_rows":37,"n_cols":7,"rows_kept":37,"cut":false,"hidden":true,"merged":[[0,0,0,2],[0,4,0,6]]}
["FY25 Benefit Tiers",null,null,null,"FY25 Benefit Tiers - Students"]
["min ","max","rate",null,"min ","max","rate"]
[0,39999,0.44,null,0,4999,0.1]
[40000,69999,0.37,null,5000,24999,0.42]
[70000,149999,0.3,null,25000,"+",0.27]
[150000,229999,0.25]
[230000,499999,0.2]
[500000,"+",0.13]
[]
["Project Staff"]
["PI"]
["Staff"]
["Study Coordinator"]
[" "]
[]
{"$rows_left_out":23}
{"sheet":"Coverage Analysis","index":3,"n_rows":35,"n_cols":14,"rows_kept":35,"cut":false,"hidden":false,"merged":[[1,2,1,3],[1,0,1,1],[2,0,2,1],[4,0,4,1],[5,0,5,1],[3,0,3,1]]}
[]
[{"$f":"Summary!A9","v":"Project Title:"},null,{"$f":"Summary!B9","v":0}]
[{"$f":"Summary!A10","v":"Principal Investigator:"},null,{"$f":"Summary!C10","v":0}]
[{"$f":"Summary!A11","v":"Sponsor/CRO:"},null,{"$f":"Summary!C11","v":0}]
[{"$f":"Summary!A12","v":"CPHS Study Number:"},null,{"$f":"Summary!C12","v":0}]
[{"$f":"Summary!A13","v":"ClinicalTrials.gov # / NCT #:"},null,{"$f":"Summary!D13","v":0},null,null,null,null,null,null,null,null,null,"Version Date:",{"$f":"LastSavedTimeStamp()","v":{"$error":"#NAME?"}}]
[]
["Category ","Procedures/ Activities","Location ","CPT Code","CDM Code",null,null,null,null,null,null,null,null,"Justifications "]
[]
[]
[]
[]
[]
[]
[]
{"$rows_left_out":21}
{"sheet":"CA Data-Validation","index":4,"n_rows":489,"n_cols":21,"rows_kept":489,"cut":false,"hidden":true,"merged":[]}
["Patient Payment","Visits","Labs        ","Anesthesiology","XRay Imaging","Tissue ","Ultrasound ","CT","MRI MRA","Nuclear Radiology","EKG ECHO","Pulmonary","Pharmacy","Parking","Cardiac","OR","Biopsy","Fluoroscopy","PET","Neurophysiology","Other"]
["Patient Payment","Clinic Visit_Est. Patient Level 1","Albumin Serum","Anes Endotracheal Tube","Abdomen Acute Series Complete","Research Handling Fee- blocks","US Abdomen Complete","Creatinine Blood Non OPID-*only use with Contrast for CT","Creatinine Blood Non OPID-*only use with Contrast for MRI","Bone Density DXA Axial Skelet","Cable ECG 12 V Lead","6 min walk","New Study Set-Up / Administrative Fee (Inpatient Study)","CRU Parking ","Angio Coronary w/o Heart Cath","Cable ECG 12 V Lead","EKG Hourly Monitor Charge","Fluoro Local  NDL Biopsy/ Aspiration","CT Thorax W/O Contrast","13 or more Nerve Conduct","Other"]
[null,"Clinic Visit_New Patient Level 2","Alk Phosphatase","Anes srvs General 1st 30 min","Abdomen AP View","Research Unstained Slides","US Abdomen Limited","OPID CT Omnipaque 300ML 10-*only use with CT and Angio Contrast","IV START PAK-*only use with Contrast for MRI","Bone Scan Three Phase Study","ECG 12/15 Lead","Alprazolam 1 MG Tab","New Study Set-Up / Administrative Fee  (Outpatient Study)",null,"Blood O2 Saturation only","Cardiac Output Measurement","Conscious Sedation> 5 years old, first 30 min",null,"PET Brain Imaging Met Eval"]
[null,"Clinic Visit_New Patient Level 3","Alpha -fetoprotein","Anes srvs General add 15 mins","Ankle 2 Views Bilateral",null,"US Brain Scan","Iodixanol 320MG/ML INJ(200ML)- *only use with CT and Angio Contrast","Electrode MRI ECG Quatrade-*only use with Contrast for MRI","Bone Scan Tomogram Spect","12 Lead ECG CPT (Tracing & Interpretation only)","Blood Gas","Annual Refrig Storage Fee",null,"Cath Lab Treatment Room","Cath 8F Cardiac Output","Skin biopsy + add  Lesion",null,"PET CT Tumor Image Skull MIDTH"]
[null,"Clinic Visit_ Est. Patient Level 4","ALT (SGPT)","Desflurane Per case","Ankle 2 Views Unilateral",null,"US Chest","Injection Kit Dual Syringe-*only use with Contrast for CT","Monitor Non-Invasive","Bone Scan Whole Body","ECG Rhythym Strip","Blood O2 Saturation","Annual Study Maintenance Fee",null,"DSA Analysis Coronary","Drape Intraop Probe SM T TIP","Oxygen ",null,"PET CT Tumor Imaging LTD area"]
[null,"Clinic Visit_ Est. Patient Level 5","Amplified Probe(MSRA)","Invasive Pressure Monitor","Ankle Complete 3+V Uni",null,"US Duplex Abd/Pel/Scrot/Kid","CT Abdomen w/Contrast","MRI Kit-*only use with Contrast for MRI","Bone Scan Whole Body","Echo 2D M Mode Comp w/Color Fl","Bronchoscopy w/Biopsy","Miscellaneous IDS FEE 15 min",null,"DSA Analysis LV Gram","Dressing Bio Patch","Biopsy Tray",null,"PET CT Tumor Imaging Whole BD"]
[null,"Room Charge","AST (SGOT)","Kit Transd 3 ml 12 in 72 in TB","Bone Density DXA Axial Skelet",null,"US Duplex Ext Veins Bilat","CT Abdomen w/out Contrast","GADOBENATE 1ML VL(7935MG/15ML)-*(contrast x 15 (qty 15= qty is equal to 1ML VL (7935MG/15ML) per 150 lb patient)  only use with Contrast for MRI","Bone Scan, Multiple Area","Echo 2D M Mode Complete","Bronchoscopy w/Bronchial Lavag","Patient Randomization",null,"Injection Venous Bypass Grafts","Injection IV Push 1st drug","Universal Precautions",null,"PET Myocard Imag Metabolic Eval"]
[null,"Venipuncture","Basic Metabolic Panel","Oximeter P/Day","Bone Survey Complete",null,"US Pelvis Complete","CT Abodomen w/out - w/Contrast","MRA Abdomen w/Contrast","Brain Scan Spect","Echo 2D M Mode Limited","Bronchoscopy w/Brushing","Per Dose RX Dispensing Fee",null,"Left & Right Heart Cath","Kit Perc Intro 8.5 FR","Pulse Oximeter",null,"PET Myocard Imag Metabolic Eval"]
[null,null,"Beta-Natriuretic Peptide (BNP)",null,"Both Knees standing anteroposterior",null,"US Retroperitoneal Limited","CT Angio Abdomen","MRA Abdomen w/out Contrast","Cardiac Scan Gated Multi(MUGA)","Echo Doppler Complete","Cardiac Output Measurement","Storage Of Used Study Medication",null,"Procedure Prep","Minor Proc Recovery  1 st hour","Biopsy Lung perc",null,"PET Tumor Image Skull Midthigh"]
[null,null,"Bicarbonate(CO2)",null,"Chest AP w/Fluoro",null,"US Scrotum & Contents","CT Angio Aorta w/Fem Runoff","MRA Abdoment w/out - w/Contrast","Cold Pyrophosphate per dose","Echo Doppler Limited","D5W 500 ml Bag","Study Annual Documentation Fee",null,"S&I Abdominal Aortagram","Minor Proc Recovery  add 30 minutes ","Skin biopsy Single Lesion",null,"PET Tumor Imaging"]
[null,null,"Bilirubin Direct",null,"Chest AP w/Lordotic",null,"US Transpl Kidney w/ Dop","CT Angio Chest w/o - w/Contrast","MRA Chest w/Contrast","Lung Perfusion Scan","Echo Follow-Up Congenital","Diffusion Capacity (DLCO)",null,null,"S&I Arterial /Vent/Angio ( Pedi)","Oxi Adult Sensor","Kit Bone Biopsy",null,"PET Tumor Imaging Limited area"]
[null,null,"Bilirubin Total",null,"Chest 2 view AP & Lateral",null,"US Transpl Kidney w/out Dop","CT Angio Extr Lower w/Contrast Uni","MRA Chest w/out - w/Contrast","TC-99M Sulfur Colloid Per Dose","Echo Follow-Up/Limited","Fentanyl 100 MCG/2 ml Vl",null,null,"S&I Cor/Pulm/Aort Angio","Pack Line Linen","Pressure bag vital signs",null,"PET Tumor Imaging Whole Body"]
[null,null,"Blood Culture",null,"Chest AP Single View",null,"US Transrectal","CT Angio Extr Lower w/o - w/Bi","MRA Head w/Contrast",null,"Echo w/Contrast","Injection  Internal Mammary",null,null,null,"Phase 2 PACU Ea Add 30 min-Rout","IV Catheter #18-24"]
[null,null,"BUN",null,"Knee 1 or 2 views",null,"US Transvaginal","CT Angio Extr Upper w/Contrast Bi","MRA Head w/out - w/Contrast",null,"Holter Analysis","Injection Pulmonary",null,null,null,"Preoperative Assessment","Conscious Sedation> 5 years old, each add 15 mins"]
[null,null,"Calcium Ionized",null,"Knee 3 views",null,null,"CT Angio Extr Upper w/Contrast Uni","MRA Head w/out Contrast",null,"Holter Placement 24 Hour","Midazolam 1 MG vl (2mg/2ml)",null,null,null,"Pressure Infuse disposable","Monitors electrodes"]
{"$rows_left_out":475}
{"sheet":"Effort","index":5,"n_rows":45,"n_cols":13,"rows_kept":45,"cut":false,"hidden":false,"merged":[[8,0,8,1],[8,2,8,3],[8,4,8,5],[13,2,13,3],[5,2,6,3],[12,4,12,5],[5,4,6,5],[7,4,7,5],[9,4,9,5],[10,4,10,5],[11,4,11,5],[13,4,13,5],[23,2,23,3],[39,2,39,3],[12,2,12,3],[14,2,14,3],[21,0,21,1],[22,0,22,1],[15,0,15,1],[15,2,15,3],[14,4,14,5],[15,4,15,5],[10,2,10,3],[11,0,11,1],[11,2,11,3],[13,0,13,1],[43,0,43,3],[39,0,39,1],[7,0,7,1],[7,2,7,3],[9,0,9,1],[9,2,9,3],[37,2,37,3],[17,2,18,3],[17,0,18,1],[19,0,19,1],[19,2,19,3],[20,0,20,1],[20,2,20,3],[21,2,21,3],[22,2,22,3],[24,2,24,3],[41,0,41,1],[41,2,41,3],[38,0,38,1],[42,0,42,1],[42,2,42,3],[25,12,25,13],[26,12,26,13],[36,0,36,1],[36,2,36,3],[27,0,27,3],[33,0,34,1],[33,2,34,3],[35,0,35,1],[35,2,35,3],[25,2,25,3],[26,2,26,3],[25,0,25,1],[26,0,26,1],[24,12,24,13],[17,12,18,13],[19,12,19,13],[20,12,20,13],[21,12,21,13],[22,12,22,13],[23,12,23,13],[95,0,95,1],[2,0,2,1],[3,0,3,1],[0,0,0,1],[1,0,1,1],[37,0,37,1],[5,0,6,1],[10,0,10,1],[14,0,14,1],[12,0,12,1],[24,0,24,1],[23,0,23,1],[44,0,44,3],[38,2,38,3],[40,0,40,1],[40,2,40,3]]}
[{"$f":"Summary!A9","v":"Project Title:"},null,{"$f":"Summary!B9","v":0}]
[{"$f":"Summary!A10","v":"Principal Investigator:"},null,{"$f":"Summary!C10","v":0}]
[{"$f":"Summary!A11","v":"Sponsor/CRO:"},null,{"$f":"Summary!C11","v":0}]
[{"$f":"Summary!A12","v":"CPHS Study Number:"},null,{"$f":"Summary!C12","v":0}]
[]
["Position ",null,"Name ",null,"Hourly Rate"]
[]
[{"$f":"Summary!A18","v":"PI"},null,{"$f":"IF(Summary!C18=0,\"\",Summary!C18)","v":""},null,{"$f":"((Summary!$E$18+ (Summary!$E$18*Summary!$J$18))/2080)","v":0},{"$f":"((Summary!$E$18+ (Summary!$E$18*Summary!$J$18))/2080)*#REF!","v":{"$error":"#REF!"}}]
[{"$f":"Summary!A19","v":"PI Oversight"},null,{"$f":"IF(Summary!C19=0,\"\",Summary!C19)","v":""},null,{"$f":"((Summary!$E$19+ (Summary!$E$19*Summary!$J$19))/2080)","v":0},{"$f":"((Summary!$E$18+ (Summary!$E$18*Summary!$J$18))/2080)*#REF!","v":{"$error":"#REF!"}}]
[{"$f":"Summary!A20","v":"Coordinator"},null,{"$f":"IF(Summary!C20=0,\"\",Summary!C20)","v":""},null,{"$f":"((Summary!$E$20+ (Summary!$E$20*Summary!$J$20))/2080)","v":0},{"$f":"((Summary!$E$18+ (Summary!$E$18*Summary!$J$18))/2080)*#REF!","v":{"$error":"#REF!"}}]
[{"$f":"Summary!A21","v":"Coordinator Admin "},null,{"$f":"IF(Summary!C21=0,\"\",Summary!C21)","v":""},null,{"$f":"((Summary!$E$21+ (Summary!$E$21*Summary!$J$21))/2080)","v":0},{"$f":"((Summary!$E$18+ (Summary!$E$18*Summary!$J$18))/2080)*#REF!","v":{"$error":"#REF!"}},null,"Note-- Effort  per person for each visit should include visit preparation and visit administration time and effort too."]
[{"$f":"Summary!A22","v":"Finanical Management"},null,{"$f":"IF(Summary!C22=0,\"\",Summary!C22)","v":""},null,{"$f":"((Summary!$E$22+ (Summary!$E$22*Summary!$J$22))/2080)","v":0},{"$f":"((Summary!$E$18+ (Summary!$E$18*Summary!$J$18))/2080)*#REF!","v":{"$error":"#REF!"}},null,"Example- Chart set up, scheduling next visit, escorting participant for imaging, data entry into CRF, etc."]
[{"$f":"Summary!A23","v":0},null,{"$f":"IF(Summary!C23=0,\"\",Summary!C23)","v":""},null,{"$f":"((Summary!$E$22+ (Summary!$E$22*Summary!$J$22))/2080)","v":0},{"$f":"((Summary!$E$18+ (Summary!$E$18*Summary!$J$18))/2080)*#REF!","v":{"$error":"#REF!"}}]
[{"$f":"Summary!A24","v":0},null,{"$f":"IF(Summary!C24=0,\"\",Summary!C24)","v":""},null,{"$f":"((Summary!$E$22+ (Summary!$E$22*Summary!$J$22))/2080)","v":0},{"$f":"((Summary!$E$18+ (Summary!$E$18*Summary!$J$18))/2080)*#REF!","v":{"$error":"#REF!"}},null,"Financial Management - Minimum .5 per visit for invoicing and/or payment reconciliation & 3 hours for last visit  for study reconciliation. (In some cases this is also the study coordinator. However the time spent for financial management is separate from and in addition to the time and effort spent during study visits therefore needs to be captured separately. "]
[{"$f":"Summary!A25","v":0},null,{"$f":"IF(Summary!C25=0,\"\",Summary!C25)","v":""},null,{"$f":"((Summary!$E$24+ (Summary!$E$24*Summary!$J$24))/2080)","v":0},{"$f":"((Summary!$E$18+ (Summary!$E$18*Summary!$J$18))/2080)*#REF!","v":{"$error":"#REF!"}},null,"Regulatory Management- Minimum .25 per visit and 3 hours for last study visit to capture continuing reviews, and amendment processing  . (In many cases the study coordinator also manages regulatory. However the time spent managing regulatory documents (SAE, Reg Binder, IND report management, IRB submissions) is separate from and in addition to the time and effort spent during study visits therefore needs to be captured separately.  "]
{"$rows_left_out":31}
{"sheet":"Cost-Expenses","index":6,"n_rows":47,"n_cols":10,"rows_kept":47,"cut":false,"hidden":false,"merged":[[4,0,4,1],[1,0,1,1],[2,0,2,1],[3,0,3,1]]}
[]
[{"$f":"Summary!A10","v":"Principal Investigator:"},null,{"$f":"Summary!C10","v":0}]
[{"$f":"Summary!A11","v":"Sponsor/CRO:"},null,{"$f":"Summary!C11","v":0}]
[{"$f":"Summary!A12","v":"CPHS Study Number:"},null,{"$f":"Summary!C12","v":0}]
[{"$f":"Summary!A13","v":"ClinicalTrials.gov # / NCT #:"},null,{"$f":"Summary!D13","v":0}]
[]
[]
[]
[]
[]
[null,"Clinical Cost"]
[null,"Procedures/Activities",{"$f":"'Coverage Analysis'!F8","v":0},{"$f":"'Coverage Analysis'!G8","v":0},{"$f":"'Coverage Analysis'!H8","v":0},{"$f":"'Coverage Analysis'!I8","v":0},{"$f":"'Coverage Analysis'!J8","v":0},{"$f":"'Coverage Analysis'!K8","v":0},{"$f":"'Coverage Analysis'!L8","v":0},{"$f":"'Coverage Analysis'!M8","v":0}]
[null,{"$f":"IF(ISBLANK('Coverage Analysis'!B9),\"\",'Coverage Analysis'!B9)","v":""}]
[null,{"$f":"IF(ISBLANK('Coverage Analysis'!B10),\"\",'Coverage Analysis'!B10)","v":""}]
[null,{"$f":"IF(ISBLANK('Coverage Analysis'!B11),\"\",'Coverage Analysis'!B11)","v":""}]
{"$rows_left_out":33}
{"sheet":"Start up and Invoiceables","index":7,"n_rows":78,"n_cols":22,"rows_kept":78,"cut":false,"hidden":false,"merged":[[58,1,58,4],[9,0,9,2],[0,0,0,1],[0,2,0,9],[1,0,1,1],[1,2,1,9],[2,0,2,1],[2,2,2,9],[4,0,4,2],[5,0,5,2],[6,0,6,2],[7,0,7,2],[8,0,8,2],[55,1,55,4],[13,0,13,2],[11,0,11,2],[77,0,77,4],[71,1,71,4],[72,1,72,4],[73,1,73,4],[74,1,74,4],[75,1,75,4],[67,0,68,0],[67,1,68,4],[69,1,69,4],[70,1,70,4],[76,0,76,4],[62,0,62,1],[63,0,63,1],[64,0,64,1],[65,0,65,1],[66,0,66,1],[59,1,59,4],[59,20,59,21],[60,1,60,4],[60,20,60,21],[61,0,61,4],[55,20,55,21],[56,1,56,4],[56,20,56,21],[57,1,57,4],[57,20,57,21],[51,20,52,21],[53,1,53,4],[53,20,53,21],[54,1,54,4],[54,20,54,21],[12,0,12,2],[10,0,10,2],[51,0,52,0],[51,1,52,4],[43,0,43,2],[16,0,16,2],[17,0,17,2],[14,0,14,2],[15,0,15,2]]}
[{"$f":"Summary!A9","v":"Project Title:"},null,{"$f":"Summary!B9","v":0}]
[{"$f":"Summary!A10","v":"Principal Investigator:"},null,{"$f":"Summary!C10","v":0}]
[{"$f":"Summary!A12","v":"CPHS Study Number:"},null,{"$f":"Summary!C12","v":0}]
[]
["Start Up Costs",null,null,"Total ","Total W IDC"]
["Start Up Effort",null,null,{"$f":"IF(U77=0,\"\",U77)","v":962.5},{"$f":"IF(U78=0,\"\",U78)","v":1251.25}]
["IRB Review Fee - Local or Permission to Rely",null,null,2000,{"$f":"IF(D7=0, \"\",D7*1.3)","v":2600},null,null,"Coverage Analysis Fees -  for  Industry  and Departmentally Sponsored studies (inclusive of IDC)"]
["Coverage Analysis Fee",null,null,{"$f":"E8/1.3","v":1545.3846153846152},{"$f":"IF(Summary!H6='Start up and Invoiceables'!H8,'Start up and Invoiceables'!I8,IF(Summary!H6='Start up and Invoiceables'!H9,'Start up and Invoiceables'!I9,IF(Summary!H6='Start up and Invoiceables'!H10,'Start up and Invoiceables'!I10,\"\")))","v":2009},null,null,"Low",2009]
["Investigational Pharmacy Setup Fee (Delete if N/A)",null,null,null,null,null,null,"Medium",3348]
["MHH Adminsitrative Start up Fee (Delete if N/A)",null,null,null,{"$f":"IF(D10=0, \"\",D10*1.3)","v":""},null,null,"High",4151]
["Radiology Dept Setup Fee (Delete if N/A)",null,null,750,975,null,null,"Complex",4151]
["CRU Start up Fee (Delete if N/A)",null,null,null,""]
["Lab set up Fee (Delete if N/A)",null,null,null,""]
["Patient Population Assessment Fee",null,null,750,975,null,null," Effective 01/01/24  IRB fee is $2600  (inclusive of IDC)  regardless of whether or not the study is requesting full board review or requesting permission to rely on outside IRB"]
[null,null,null,null,"",null,null," Effective 09/01/25 Patient Population Assessment fee is $750  (w/o IDC)  for SBMI/EPIC IT to conduct feasability reports"]
{"$rows_left_out":64}
{"sheet":"QQBR","index":8,"n_rows":45,"n_cols":14,"rows_kept":45,"cut":false,"hidden":false,"merged":[[14,13,20,19],[6,0,6,2],[6,3,6,5],[45,0,50,9],[34,0,34,9],[35,0,35,9],[36,0,36,9],[37,0,37,9],[38,0,38,9],[39,0,39,9],[40,0,40,9],[41,0,41,9],[44,0,44,9],[29,0,29,9],[30,0,30,9],[31,0,31,9],[32,0,32,9],[33,0,33,9],[24,0,24,11],[26,0,26,9],[27,0,27,9],[28,0,28,9],[1,1,1,11],[4,2,4,5],[5,0,5,2],[5,3,5,5],[5,6,5,7],[5,8,5,11],[21,0,21,6],[21,7,21,11],[22,0,22,6],[22,7,22,11],[23,0,23,6],[23,7,23,11],[18,0,18,11],[20,0,20,6],[20,7,20,11],[17,0,17,6],[17,7,17,11],[19,0,19,11],[13,0,13,6],[13,7,13,11],[15,0,15,11],[14,0,14,6],[14,7,14,11],[11,7,11,11],[12,0,12,6],[12,7,12,11],[9,0,10,6],[9,7,9,11],[16,0,16,11],[10,7,10,11],[7,0,7,11],[8,0,8,11],[2,8,2,11],[3,2,3,5],[3,6,3,7],[3,8,3,11],[4,6,4,7],[4,8,4,11],[3,0,3,1],[4,0,4,1],[2,0,2,1],[2,2,2,5],[2,6,2,7],[11,0,11,6]]}
[]
["Project Title:",{"$f":"Summary!B9","v":0}]
["Principal Investigator:",null,{"$f":"Summary!C10","v":0},null,null,null,"Department:",null,{"$f":"Summary!I10","v":0}]
["Sponsor/CRO:",null,{"$f":"Summary!C11","v":0},null,null,null,"Project Period:",null,{"$f":"Summary!I11","v":0}]
["CPHS Study Number:",null,{"$f":"Summary!C12","v":0},null,null,null,"Coordinator:",null,{"$f":"Summary!I12","v":0}]
["ClinicalTrials.gov # / NCT #:",null,null,{"$f":"Summary!D13","v":0},null,null,"IDE #:",null,{"$f":"Summary!I13","v":0}]
["Coverage Analysis Version Date:",null,null,{"$f":"'Coverage Analysis'!N6","v":{"$error":"#NAME?"}}]
[]
["Device Studies"]
["What type of device is being studied?"]
[]
["Is the investigational product provided for free by sponsor?"]
["If IDE, has the device “packet” been sent to CMS for approval?"]
["Has it been approved by CMS for billing?"]
["Has the MHH device checklist been completed?",null,null,null,null,null,null,null,null,null,null,null,null,"A DEEMED study is one that meets one of the following criteria:\n\n1. Trials funded by NIH, CDC, AHRQ, CMS, DOD or VA.\n2. Trials supported by centers or cooperative groups that are funded by the NIH, CDC, AHRQ, CMS, DOD or VA.\n3. Trials conducted under an investigational new drug application (IND) reviewed by the FDA.\n4. Drug trials that  are exempt from having an IND under 21 CFR 312.2(b)(1)."]
{"$rows_left_out":31}
{"sheet":"Budget","index":9,"n_rows":95,"n_cols":16,"rows_kept":95,"cut":false,"hidden":true,"merged":[[65,0,65,2],[66,0,66,2],[67,0,67,2],[68,0,68,2],[94,0,94,2],[60,0,60,2],[61,0,61,2],[62,0,62,2],[63,0,63,2],[64,0,64,2],[55,0,55,2],[56,0,56,2],[57,0,57,2],[58,0,58,2],[59,0,59,2],[2,1,2,3],[3,1,3,3],[6,1,6,3],[5,1,5,3],[4,1,4,3]]}
["Summary info:",null,null,null,null,null,null,null,null,null,"Summary Information ",null,"Total Direct","Total W/IDC","Grand Total"]
["Project info:",null,null,null,null,null,null,null,null,null,null,"Start up ",{"$f":"Summary!L30","v":6007.8846153846152},{"$f":"M2*Summary!I14","v":1802.3653846153845},{"$f":"M2+N2","v":7810.25}]
["Project Title:",{"$f":"Summary!B9","v":0},null,null,"Department",{"$f":"Summary!I10","v":0},null,null,null,null,null,"Invoiceable",{"$f":"Summary!G31","v":1000},{"$f":"M3*Summary!I14","v":300},{"$f":"M3+N3","v":1300}]
["PI ",{"$f":"Summary!C10","v":0},null,null,"Project Period",{"$f":"Summary!I11","v":0},null,null,null,null,null,"Patient care ",{"$f":"Summary!J33*Summary!D14","v":0},{"$f":"M4*Summary!I14","v":0},{"$f":"M4+N4","v":0}]
["Spnosr",{"$f":"Summary!C11","v":0},null,null,"Coordinator",{"$f":"Summary!I12","v":0},null,null,null,null,null,"Effort",{"$f":"Summary!L27","v":0},{"$f":"M5*Summary!I14","v":0},{"$f":"M5+N5","v":0}]
["CPHS Study Number ",{"$f":"Summary!C12","v":0},null,null,"IDE#",{"$f":"Summary!I13","v":0},null,null,null,null,null,"Grand total",{"$f":"SUM(M2:M5)-M3","v":6007.8846153846152},{"$f":"M6*Summary!I14","v":1802.3653846153845},{"$f":"M6+N6","v":7810.25},"Does not include invoiceable costs "]
["Expected # of Patients",{"$f":"Summary!D14","v":0},null,null,"ICD RATE:",{"$f":"Summary!I14","v":0.3},null,null,null,null,null,{"$f":"Summary!A41","v":"Total Anticipated Revenue"},null,null,{"$f":"Summary!G41","v":0}]
[null,null,null,null,null,null,null,null,null,null,null,"Study Revenue or Deficit",null,null,{"$f":"Summary!G42","v":-7810.25}]
[null,null,null,null,null,null,null,null,null,null,null,"Total Cost to UTH per 1 Patient excluding start up costs",null,null,{"$f":"(O5+O4)/Summary!D14","v":{"$error":"#DIV/0!"}},"Expense cost + effort +plus IDC  "]
[]
["Clinical Cost"]
["Procedures/Activities",{"$f":"'Coverage Analysis'!F8","v":0},{"$f":"'Coverage Analysis'!G8","v":0},{"$f":"'Coverage Analysis'!H8","v":0},{"$f":"'Coverage Analysis'!I8","v":0},{"$f":"'Coverage Analysis'!J8","v":0},{"$f":"'Coverage Analysis'!K8","v":0},{"$f":"'Coverage Analysis'!L8","v":0},{"$f":"'Coverage Analysis'!M8","v":0}]
[{"$f":"IF(ISBLANK('Cost-Expenses'!B13),,'Cost-Expenses'!B13)","v":""}]
[{"$f":"IF(ISBLANK('Cost-Expenses'!B14),,'Cost-Expenses'!B14)","v":""}]
[{"$f":"IF(ISBLANK('Cost-Expenses'!B15),,'Cost-Expenses'!B15)","v":""}]
{"$rows_left_out":80}